Target
Orexin/Hypocretin receptor type 1
Ligand
BDBM479230
Substrate
Meas. Tech.
Orexin Receptor Cell-Based Functional Assay
IC50
2.00±n/a nM
Citation
 Kamenecka, TMHolenz, JWesolowski, SHe, YBürli, R Halo-substituted piperidines as orexin receptor modulators US Patent  US10894789 Publication Date 1/19/2021 
Target
Name:
Orexin/Hypocretin receptor type 1
Synonyms:
HCRTR1 OX1R_HUMAN Orexin receptor type 1 (OR 1) Orexin receptor type 1 (OX1) Orexin receptor type 1 (OxR1) | Ox1r
Type:
Protein
Mol. Mass.:
47554.50
Organism:
Homo sapiens (Human)
Description:
O43613
Residue:
425
  
Inhibitor
Name:
BDBM479230
Synonyms:
US10894789, Compound 21
Type:
Small organic molecule
Emp. Form.:
C23H23F5N6O
Mol. Mass.:
494.4603
SMILES:
C[C@@H]1CC(F)(F)CN(C1CNc1ncc(cn1)C(F)(F)F)C(=O)c1nn(C)cc1-c1ccccc1
: