BDBM221073 SPHINX scaffold, 3::US9695160, SPHINX7::US9796707, Reference Compound SPHINX7
SMILES CN(C)CCN1CCN(CC1)c1ccc(cc1NC(=O)c1ccc(o1)-c1ccncc1)C(F)(F)F
InChI Key InChIKey=ALLIMXLDTJFWHR-UHFFFAOYSA-N
Data  5 IC50
  Tab Delimited (TSV)   2D SDfile   Computed 3D by Vconf -m prep SDfile
Find this compound or compounds like it in BindingDB:
Activity Spreadsheet -- Enzyme Inhibition Constant Data from BindingDB
Found 5 hits for monomerid = 221073
TargetSRSF protein kinase 1(Homo sapiens (Human))
Exonate
LigandPNGBDBM221073(SPHINX scaffold, 3 | US9695160, SPHINX7 | US979670...)
Affinity DataIC50:  59nMpH: 7.5 T: 2°C. Assay description: A reaction buffer containing 200 mM Tris pH 7.5, 100 mM MgCl2 and 0.1 mg/ml BSA was added to 43 μM SRSF1Arg-Ser (RS) peptide (NH2-RSPSYGRSRSRSRS...
Ligand InfoPC cidPC sid
In DepthDetails ArticlePubMed
TargetPotassium voltage-gated channel subfamily H member 2(Homo sapiens (Human))
Exonate
LigandPNGBDBM221073(SPHINX scaffold, 3 | US9695160, SPHINX7 | US979670...)
Affinity DataIC50:  36nMpH: 7.45 T: 2°C. Assay description: Whole cell patch clamp recordings of hERG current (IhERG) were made at 37 °C from human embryonic kidney cells (HEK 293) cells stably expressing ...
Ligand InfoPC cidPC sid
In DepthDetails ArticlePubMed
TargetSRSF protein kinase 1(Homo sapiens (Human))
Exonate
LigandPNGBDBM221073(SPHINX scaffold, 3 | US9695160, SPHINX7 | US979670...)
Affinity DataIC50:  59nM. Assay description: Inhibition of SRPK1 (unknown origin)
Ligand InfoPC cidPC sid
In DepthDetails PubMed
TargetSRSF protein kinase 1(Homo sapiens (Human))
Exonate
LigandPNGBDBM221073(SPHINX scaffold, 3 | US9695160, SPHINX7 | US979670...)
Affinity DataIC50:  54.7nM. Assay description: Candidate compounds were screened by the Kinase-Glo assay (Promega; Koresawa and Okabe, 2004), the results of which are shown in Table 1 and Table 2....
Ligand InfoPC cidPC sid
In DepthDetails US Patent
TargetSRSF protein kinase 1(Homo sapiens (Human))
Exonate
LigandPNGBDBM221073(SPHINX scaffold, 3 | US9695160, SPHINX7 | US979670...)
Affinity DataIC50:  55nMT: 2°C. Assay description: Candidate compounds were screened by the Kinase-Glo assay (Promega; Koresawa and Okabe, 2004), the results of which are shown in Table 1 and Table 2....
Ligand InfoPC cidPC sid
In DepthDetails US Patent