BDBM222090 6-(4-Isobutylphenyl)-2-oxo-4-(2-thienyl)-1,2-dihydropyridine-3-carbonitrile (4l)
SMILES CC(C)Cc1ccc(cc1)-c1cc(-c2cccs2)c(C#N)c(=O)[nH]1
InChI Key InChIKey=OWZDSQFQTQRAOE-UHFFFAOYSA-N
Data  2 IC50
  Tab Delimited (TSV)   2D SDfile   Computed 3D by Vconf -m prep SDfile
Find this compound or compounds like it in BindingDB:
Activity Spreadsheet -- Enzyme Inhibition Constant Data from BindingDB
Found 2 hits for monomerid = 222090
TargetProstaglandin G/H synthase 2(Ovis aries (Sheep))
Fayoum University
LigandPNGBDBM222090(6-(4-Isobutylphenyl)-2-oxo-4-(2-thienyl)-1,2-dihyd...)
Affinity DataIC50:  3.70E+3nM. Assay description: The ability of the tested compounds to inhibit both isozymes, COX-1 and COX-2 was measured using colorimetric COX (ovine) Inhibitor Screening Assay K...
Ligand InfoPC cidPC sid
In DepthDetails ArticlePubMed
TargetProstaglandin G/H synthase 1(Ovis aries (Sheep))
Fayoum University
LigandPNGBDBM222090(6-(4-Isobutylphenyl)-2-oxo-4-(2-thienyl)-1,2-dihyd...)
Affinity DataIC50:  1.27E+4nM. Assay description: The ability of the tested compounds to inhibit both isozymes, COX-1 and COX-2 was measured using colorimetric COX (ovine) Inhibitor Screening Assay K...
Ligand InfoPC cidPC sid
In DepthDetails ArticlePubMed