BDBM26049 [2-(4-{4-[(1E)-1-(hydroxyimino)-2,3-dihydro-1H-inden-5-yl]-5-(pyridin-4-yl)furan-2-yl}phenoxy)ethyl]dimethylamine::furan-based compound, 10
SMILES CN(C)CCOc1ccc(cc1)-c1cc(c(o1)-c1ccncc1)-c1ccc2C(CCc2c1)N=O
InChI Key InChIKey=FQJVPSLTXAODEC-UHFFFAOYSA-N
Data  1 Kd
  Tab Delimited (TSV)   2D SDfile   Computed 3D by Vconf -m prep SDfile
Find this compound or compounds like it in BindingDB:
Activity Spreadsheet -- Enzyme Inhibition Constant Data from BindingDB
Found 1 hit for monomerid = 26049
TargetSerine/threonine-protein kinase B-raf(Homo sapiens (Human))
Gsk
LigandPNGBDBM26049([2-(4-{4-[(1E)-1-(hydroxyimino)-2,3-dihydro-1H-ind...)
Affinity DataKd:  0.5nMpH: 7.5 T: 2°C. Assay description: The kinase enzyme, fluorescent ligand and a variable concentration of test compound are incubated together to reach thermodynamic equilibrium under c...
In DepthDetails ArticlePubMed