BDBM411879 US10392391, Compound I-O-24::US10787452, Compound I-O-24::US11117900, Compound I-O-24::US11370798, Cmpd. # I-O-24::US20230271963, Compound I-O-24
SMILES CN(C)CCOc1ccncc1NC(=O)c1c(N)nn2cc(CC#N)cnc12
InChI Key InChIKey=FHGWGBDZXNOSLY-UHFFFAOYSA-N
Data  5 KI
  Tab Delimited (TSV)   2D SDfile   Computed 3D by Vconf -m prep SDfile
Find this compound or compounds like it in BindingDB:
Activity Spreadsheet -- Enzyme Inhibition Constant Data from BindingDB
Found 1 hit for monomerid = 411879
TargetSerine/threonine-protein kinase ATR(Homo sapiens (Human))
Vertex Pharmaceuticals
US Patent
LigandPNGBDBM411879(US10392391, Compound I-O-24 | US10787452, Compound...)
Affinity DataKi:  600nM. Assay description: Compounds were screened for their ability to inhibit ATR kinase using a radioactive-phosphate incorporation assay. Assays were carried out in a mixtu...
Ligand Info
In DepthDetails US Patent