BDBM443430 US10654866, Example 1B::US11117902, Example 1A::US11634426, Example 1B
SMILES Oc1ccc2c3[C@@H](Oc4cc(ccc4-c3cnc2c1)C(F)(F)F)c1ccc(OCCN2CC(CF)C2)cc1
InChI Key InChIKey=UVBQMXOKKDCBJN-NDEPHWFRSA-N
Data  6 KI
  Tab Delimited (TSV)   2D SDfile   Computed 3D by Vconf -m prep SDfile
Find this compound or compounds like it in BindingDB:
Activity Spreadsheet -- Enzyme Inhibition Constant Data from BindingDB
Found 6 hits for monomerid = 443430
TargetEstrogen receptor(Homo sapiens (Human))
Eli Lilly
US Patent
LigandPNGBDBM443430(US10654866, Example 1B | US11117902, Example 1A | ...)
Affinity DataKi:  0.310nM. Assay description: Run the competition binding assay in a buffer containing 50 mM HEPES, pH 7.5, 1.5 mM EDTA, 150 mM NaCl, 10% glycerol, 1 mg/mL ovalbumin, and 5 mM DTT...
In DepthDetails US Patent
TargetEstrogen receptor(Homo sapiens (Human))
Eli Lilly
US Patent
LigandPNGBDBM443430(US10654866, Example 1B | US11117902, Example 1A | ...)
Affinity DataKi:  0.310nM. Assay description: The purpose of the following ER competition binding assays is to determine the affinity of a test compound against ERα (wild type), ERα (Y5...
In DepthDetails US Patent
TargetEstrogen receptor [Y537S](Homo sapiens (Human))
Eli Lilly
US Patent
LigandPNGBDBM443430(US10654866, Example 1B | US11117902, Example 1A | ...)
Affinity DataKi:  2.79nM. Assay description: Run the competition binding assay in a buffer containing 50 mM HEPES, pH 7.5, 1.5 mM EDTA, 150 mM NaCl, 10% glycerol, 1 mg/mL ovalbumin, and 5 mM DTT...
In DepthDetails US Patent
TargetEstrogen receptor [Y537S](Homo sapiens (Human))
Eli Lilly
US Patent
LigandPNGBDBM443430(US10654866, Example 1B | US11117902, Example 1A | ...)
Affinity DataKi:  2.79nM
In DepthDetails US Patent
TargetEstrogen receptor(Homo sapiens (Human))
Eli Lilly
US Patent
LigandPNGBDBM443430(US10654866, Example 1B | US11117902, Example 1A | ...)
Affinity DataKi:  12.4nM. Assay description: The purpose of the following ER competition binding assays is to determine the affinity of a test compound against ERα (wild type), ERα (Y5...
In DepthDetails US Patent
TargetEstrogen receptor [Y537S](Homo sapiens (Human))
Eli Lilly
US Patent
LigandPNGBDBM443430(US10654866, Example 1B | US11117902, Example 1A | ...)
Affinity DataKi:  57.2nM. Assay description: The purpose of the following ER competition binding assays is to determine the affinity of a test compound against ERα (wild type), ERα (Y5...
In DepthDetails US Patent