BDBM452493 US10710986, Example 634::US11555029, No. 634
SMILES COc1nc(cnc1CN1CCC(CO)(CO)C1)-c1cccc(c1Cl)-c1cccc(c1Cl)-c1cnc(CN2CCC(CO)(CO)C2)c(OC)n1
InChI Key InChIKey=LDCZNKGDQJRGBQ-UHFFFAOYSA-N
Data  2 IC50
  Tab Delimited (TSV)   2D SDfile   Computed 3D by Vconf -m prep SDfile
Find this compound or compounds like it in BindingDB:
Activity Spreadsheet -- Enzyme Inhibition Constant Data from BindingDB
Found 2 hits for monomerid = 452493
TargetProgrammed cell death 1 ligand/protein 1(Homo sapiens)
Gilead Sciences
US Patent
LigandPNGBDBM452493(US10710986, Example 634 | US11555029, No. 634)
Affinity DataIC50:  0.0640nM. Assay description: Compounds were tested in biochemical protein-protein interaction assays to determine if they can specifically block the interaction between the extra...
Ligand InfoPC cidPC sid
In DepthDetails US Patent
TargetProgrammed cell death 1 ligand 1 [19-238]/protein 1 [25-167](Homo sapiens (Human))
Gilead Sciences
US Patent
LigandPNGBDBM452493(US10710986, Example 634 | US11555029, No. 634)
Affinity DataIC50:  0.0640nM. Assay description: Compounds were tested in biochemical protein-protein interaction assays to determine if they can specifically block the interaction between the extra...
Ligand InfoPC cidPC sid
In DepthDetails US Patent