BDBM47444 1-(5-bromo-2-thienyl)-2-(3-butyl-2-imino-benzimidazol-1-yl)ethanone;hydrobromide::1-(5-bromo-2-thiophenyl)-2-(3-butyl-2-imino-1-benzimidazolyl)ethanone;hydrobromide::1-(5-bromothiophen-2-yl)-2-(3-butyl-2-iminobenzimidazol-1-yl)ethanone;hydrobromide::2-(2-azanylidene-3-butyl-benzimidazol-1-yl)-1-(5-bromanylthiophen-2-yl)ethanone;hydrobromide::MLS000765776::SMR000278882::cid_2859351
SMILES CCCCn1c2ccccc2n(CC(=O)c2ccc(Br)s2)c1=N
InChI Key InChIKey=YIZLTIFLROUFJY-UHFFFAOYSA-N
Data  1 IC50
  Tab Delimited (TSV)   2D SDfile   Computed 3D by Vconf -m prep SDfile
Find this compound or compounds like it in BindingDB:
Activity Spreadsheet -- Enzyme Inhibition Constant Data from BindingDB
Found 1 hit for monomerid = 47444
TargetTyrosine-protein kinase JAK2(Homo sapiens (Human))
The Scripps Research Institute Molecular Screening Center
Curated by PubChem BioAssay
LigandPNGBDBM47444(1-(5-bromo-2-thienyl)-2-(3-butyl-2-imino-benzimida...)
Affinity DataIC50:  4.37E+3nM. Assay description: Source (MLPCN Center Name): The Scripps Research Institute Molecular Screening Center (SRIMSC) Center Affiliation: The Scripps Research Institute (TS...
In DepthDetails PCBioAssay