BDBM47467 2-(6-methoxy-2-methyl-quinolin-4-yl)sulfanyl-1,3-benzothiazole::2-(6-methoxy-2-methylquinolin-4-yl)sulfanyl-1,3-benzothiazole::2-[(6-methoxy-2-methyl-4-quinolinyl)thio]-1,3-benzothiazole::2-[(6-methoxy-2-methyl-4-quinolyl)thio]-1,3-benzothiazole::MLS000737419::SMR000528135::cid_224687
SMILES COc1ccc2nc(C)cc(Sc3nc4ccccc4s3)c2c1
InChI Key InChIKey=PGWZWDHGBCTCBR-UHFFFAOYSA-N
Data  2 IC50  1 EC50
  Tab Delimited (TSV)   2D SDfile   Computed 3D by Vconf -m prep SDfile
Find this compound or compounds like it in BindingDB:
Activity Spreadsheet -- Enzyme Inhibition Constant Data from BindingDB
Found 3 hits for monomerid = 47467
TargetTyrosine-protein kinase JAK2(Homo sapiens (Human))
The Scripps Research Institute Molecular Screening Center
Curated by PubChem BioAssay
LigandPNGBDBM47467(2-(6-methoxy-2-methyl-quinolin-4-yl)sulfanyl-1,3-b...)
Affinity DataIC50:  6.96E+3nM. Assay description: Source (MLPCN Center Name): The Scripps Research Institute Molecular Screening Center (SRIMSC) Center Affiliation: The Scripps Research Institute (TS...
Ligand InfoPC cidPC sid
In DepthDetails PCBioAssay
TargetMultidrug efflux pump(Candida albicans)
Nmmlsc
Curated by PubChem BioAssay
LigandPNGBDBM47467(2-(6-methoxy-2-methyl-quinolin-4-yl)sulfanyl-1,3-b...)
Affinity DataEC50:  479nM. Assay description: UNMCMD Assay Overview: Assay Support: 1 R03 MH087406-01A1 Project Title: Identification of broad-spectrum antifungal efflux pump inhibitors ...
Ligand InfoPC cidPC sid
In DepthDetails PCBioAssay
TargetProtein RecA(Mycobacterium tuberculosis H37Rv)
Southern Research Specialized Biocontainment Screening Center
Curated by PubChem BioAssay
LigandPNGBDBM47467(2-(6-methoxy-2-methyl-quinolin-4-yl)sulfanyl-1,3-b...)
Affinity DataIC50:  4.23E+4nM. Assay description: Southern Research's Specialized Biocontainment Screening Center (SRSBSC) Southern Research Institute (Birmingham, Alabama) NIH Molecular Librarie...
Ligand InfoPC cidPC sid
In DepthDetails PCBioAssay