BDBM492982 2-[3-(3,3-difluoroazetidin-1-yl)phenyl]-2-ethoxy-N-[5-[[(3R)-1-pyridazin-3-ylpyrrolidin-3-yl]amino]-1,3,4-thiadiazol-2-yl]acetamide::US10981904, Example 29
SMILES CCO[C@H](C(=O)Nc1nnc(N[C@@H]2CCN(C2)c2cccnn2)s1)c1cccc(c1)N1CC(F)(F)C1
InChI Key InChIKey=PROIAWBRPAQRJA-APWZRJJASA-N
Data  1 IC50
  Tab Delimited (TSV)   2D SDfile   Computed 3D by Vconf -m prep SDfile
Find this compound or compounds like it in BindingDB:
Activity Spreadsheet -- Enzyme Inhibition Constant Data from BindingDB
Found 1 hit for monomerid = 492982
TargetGlutaminase kidney isoform, mitochondrial [63-669](Homo sapiens (Human))
Cancer Research Technology
US Patent
LigandPNGBDBM492982(2-[3-(3,3-difluoroazetidin-1-yl)phenyl]-2-ethoxy-N...)
Affinity DataIC50:  51.1nM. Assay description: A Glutamate Oxidase/AmplexRed coupled assay was used to measure the ability of compounds to bind to and inhibit the activity of GLS1 in vitro. 6His t...
Ligand InfoPC cidPC sid
In DepthDetails US Patent