BDBM50130648 CHEMBL432798::N-{4-[5-(4-Fluoro-phenyl)-3-methyl-2-methylsulfanyl-3H-imidazol-4-yl]-pyridin-2-yl}-acetamide
SMILES CSc1nc(c(-c2ccnc(NC(C)=O)c2)n1C)-c1ccc(F)cc1
InChI Key InChIKey=CJKGORBZVWDVRY-UHFFFAOYSA-N
Data  8 IC50
  Tab Delimited (TSV)   2D SDfile   Computed 3D by Vconf -m prep SDfile
Find this compound or compounds like it in BindingDB:
Activity Spreadsheet -- Enzyme Inhibition Constant Data from BindingDB
Found 8 hits for monomerid = 50130648
TargetMitogen-activated protein kinase 14(Homo sapiens (Human))
Eberhard-Karls-University Tu£Bingen
Curated by ChEMBL
LigandPNGBDBM50130648(CHEMBL432798 | N-{4-[5-(4-Fluoro-phenyl)-3-methyl-...)
Affinity DataIC50:  188nM. Assay description: Inhibition of p38 alpha MAPK in human whole blood assessed as phosphorylation of ATF-2 by immunosorbent non-radioactive enzyme assay
In DepthDetails ArticlePubMed
TargetMitogen-activated protein kinase 11/12/13/14(Homo sapiens (Human))
Eberhard-Karls-University T£Bingen
Curated by ChEMBL
LigandPNGBDBM50130648(CHEMBL432798 | N-{4-[5-(4-Fluoro-phenyl)-3-methyl-...)
Affinity DataIC50:  1.10E+3nM. Assay description: Inhibitory activity against TNF-alpha release in PBM cells
In DepthDetails ArticlePubMed
TargetMitogen-activated protein kinase 11/12/13/14(Homo sapiens (Human))
Eberhard-Karls-University T£Bingen
Curated by ChEMBL
LigandPNGBDBM50130648(CHEMBL432798 | N-{4-[5-(4-Fluoro-phenyl)-3-methyl-...)
Affinity DataIC50:  1.25E+4nM. Assay description: Inhibition of p38-related TNF-alpha release by whole blood cells at 10 e-4 to 10 e-8 M
In DepthDetails ArticlePubMed
TargetMitogen-activated protein kinase 14(Homo sapiens (Human))
Eberhard-Karls-University Tu£Bingen
Curated by ChEMBL
LigandPNGBDBM50130648(CHEMBL432798 | N-{4-[5-(4-Fluoro-phenyl)-3-methyl-...)
Affinity DataIC50:  500nM. Assay description: Inhibition of rat neutrophil 5- Lipoxygenase (5-LO)
In DepthDetails PubMed
TargetMitogen-activated protein kinase 11/12/13/14(Homo sapiens (Human))
Eberhard-Karls-University T£Bingen
Curated by ChEMBL
LigandPNGBDBM50130648(CHEMBL432798 | N-{4-[5-(4-Fluoro-phenyl)-3-methyl-...)
Affinity DataIC50:  75nM. Assay description: Inhibitory activity against induction of IL-1-beta release in PBMCs
In DepthDetails ArticlePubMed
TargetMitogen-activated protein kinase 11/12/13/14(Homo sapiens (Human))
Eberhard-Karls-University T£Bingen
Curated by ChEMBL
LigandPNGBDBM50130648(CHEMBL432798 | N-{4-[5-(4-Fluoro-phenyl)-3-methyl-...)
Affinity DataIC50:  500nM. Assay description: Inhibitory activity against mitogen-activated protein kinase p38 at 10 e-4 to 10 e-8 M concentration
In DepthDetails ArticlePubMed
TargetPotassium voltage-gated channel subfamily H member 2(Homo sapiens (Human))
C-A-I-R Biosciences
Curated by ChEMBL
LigandPNGBDBM50130648(CHEMBL432798 | N-{4-[5-(4-Fluoro-phenyl)-3-methyl-...)
Affinity DataIC50:  2.86E+4nM. Assay description: Inhibition of human ERG expressed in HEK293 cells by patch clamp method
In DepthDetails ArticlePubMed
TargetMitogen-activated protein kinase 11/12/13/14(Homo sapiens (Human))
Eberhard-Karls-University T£Bingen
Curated by ChEMBL
LigandPNGBDBM50130648(CHEMBL432798 | N-{4-[5-(4-Fluoro-phenyl)-3-methyl-...)
Affinity DataIC50:  1.08E+4nM. Assay description: Inhibition of p38-related IL1-beta release by whole blood cells at 10 e-4 to 10 e-8 M
In DepthDetails ArticlePubMed