BDBM50210051 CHEMBL3883439
SMILES CCCC(O)CC(=O)CCc1ccc(O)c(OC)c1
InChI Key InChIKey=GDRKZARFCIYVCI-UHFFFAOYSA-N
Data  3 IC50
  Tab Delimited (TSV)   2D SDfile   Computed 3D by Vconf -m prep SDfile
Find this compound or compounds like it in BindingDB:
Activity Spreadsheet -- Enzyme Inhibition Constant Data from BindingDB
Found 3 hits for monomerid = 50210051
TargetLeukotriene A-4 hydrolase(Homo sapiens (Human))
Mansoura University
Curated by ChEMBL
LigandPNGBDBM50210051(CHEMBL3883439)
Affinity DataIC50: >1.00E+5nM. Assay description: Inhibition of recombinant C-terminal His-tagged human LTA4H epoxide hydrolase activity expressed in Escherichia coli assessed as reduction in LTB4 pr...
In DepthDetails ArticlePubMed
TargetHTH-type quorum-sensing regulator RhlR(Pseudomonas aeruginosa (strain ATCC 15692 / PAO1 /...)
Korea University
Curated by ChEMBL
LigandPNGBDBM50210051(CHEMBL3883439)
Affinity DataIC50:  2.18E+5nM. Assay description: Antagonist activity at Pseudomonas aeruginosa RhlR expressed in Escherichia coli DH5alpha incubated for 1.5 hrs by luminescence reporter gene assay
In DepthDetails ArticlePubMed
TargetLeukotriene A-4 hydrolase(Homo sapiens (Human))
Mansoura University
Curated by ChEMBL
LigandPNGBDBM50210051(CHEMBL3883439)
Affinity DataIC50: >1.00E+5nM. Assay description: Inhibition of recombinant C-terminal His-tagged human LTA4H epoxide hydrolase activity expressed in Escherichia coli assessed as reduction in LTB4 pr...
In DepthDetails ArticlePubMed