BDBM50435130 CHEMBL1893324
SMILES CC[C@H](C)[C@H](NC(=O)[C@H](CO)NC(=O)[C@H](CC(N)=O)NC(=O)[C@H](CC(C)C)NC(=O)[C@H](Cc1ccc(O)cc1)NC(=O)[C@H](CCCCN)NC(=O)[C@H](CCCCN)NC(=O)[C@@H](NC(=O)[C@H](C)NC(=O)[C@H](CCSC)NC(=O)[C@H](CCC(N)=O)NC(=O)[C@H](CCCCN)NC(=O)[C@H](CCCNC(N)=N)NC(=O)[C@H](CC(C)C)NC(=O)[C@H](CCCNC(N)=N)NC(=O)[C@@H](NC(=O)[C@H](Cc1ccc(O)cc1)NC(=O)[C@H](CC(N)=O)NC(=O)[C@H](CC(O)=O)NC(=O)[C@@H](NC(=O)[C@H](Cc1ccccc1)NC(=O)[C@@H](NC(=O)[C@H](C)NC(=O)[C@H](CC(O)=O)NC(=O)[C@H](CO)NC(=O)[C@@H](N)Cc1cnc[nH]1)C(C)C)[C@@H](C)O)[C@@H](C)O)C(C)C)C(=O)N[C@@H](CC(C)C)C(=O)N[C@@H](CC(N)=O)C(N)=O
InChI Key InChIKey=HEOYHMUESMJFDC-RIWXPGAOSA-N
Data  1 KI  3 IC50  3 EC50
  Tab Delimited (TSV)   2D SDfile   Computed 3D by Vconf -m prep SDfile
Find this compound or compounds like it in BindingDB:
Activity Spreadsheet -- Enzyme Inhibition Constant Data from BindingDB
Found 7 hits for monomerid = 50435130
TargetVasoactive intestinal polypeptide receptor 1(Homo sapiens (Human))
Universit£
Curated by ChEMBL
LigandPNGBDBM50435130(CHEMBL1893324)
Affinity DataKi:  0.0670nM. Assay description: Binding affinity to human VPAC1 receptor by radioligand displacement assay
In DepthDetails ArticlePubMed
TargetVasoactive intestinal polypeptide receptor 1(Homo sapiens (Human))
Universit£
Curated by ChEMBL
LigandPNGBDBM50435130(CHEMBL1893324)
Affinity DataIC50:  0.120nM. Assay description: Binding affinity to human VPAC1 receptor by radioligand displacement assay
In DepthDetails ArticlePubMed
TargetVasoactive intestinal polypeptide receptor 1(Homo sapiens (Human))
Universit£
Curated by ChEMBL
LigandPNGBDBM50435130(CHEMBL1893324)
Affinity DataIC50:  0.120nM. Assay description: Binding affinity to human VPAC1 receptor by radioligand displacement assay
In DepthDetails ArticlePubMed
TargetVasoactive intestinal polypeptide receptor 2(Homo sapiens (Human))
Amgen
Curated by ChEMBL
LigandPNGBDBM50435130(CHEMBL1893324)
Affinity DataEC50:  0.0800nM. Assay description: Agonist activity at VPAC2 in human SH-SY5Y cells assessed as cAMP accumulation incubated for 60 mins by Eu-cAMP tracer based LANCE ultra cAMP assay
In DepthDetails PubMed
LigandPNGBDBM50435130(CHEMBL1893324)
Affinity DataEC50:  2.30nM. Assay description: Agonist activity at PAC1R in human SH-SY5Y cells assessed as cAMP accumulation incubated for 60 mins by Eu-cAMP tracer based LANCE ultra cAMP assay
In DepthDetails PubMed
TargetVasoactive intestinal polypeptide receptor 1(Homo sapiens (Human))
Universit£
Curated by ChEMBL
LigandPNGBDBM50435130(CHEMBL1893324)
Affinity DataEC50:  0.0200nM. Assay description: Agonist activity at VPAC1 in human SH-SY5Y cells assessed as cAMP accumulation incubated for 60 mins by Eu-cAMP tracer based LANCE ultra cAMP assay
In DepthDetails PubMed
TargetVasoactive intestinal polypeptide receptor 1(Homo sapiens (Human))
Universit£
Curated by ChEMBL
LigandPNGBDBM50435130(CHEMBL1893324)
Affinity DataIC50:  0.110nM. Assay description: Displacement of [125I]VIP from human recombinant VIP1 receptor expressed in CHO cells
In DepthDetails ArticlePubMed