BDBM50481947 CHEBI:8416::GNF-Pf-476::PRISTIMERIN::Pristimerine::US11660306, Example Pristimerin::acs.jmedchem.1c00409_ST.332
SMILES [H][C@@]12C[C@@](C)(CC[C@]1(C)CC[C@]1(C)C3=CC=C4C(C)=C(O)C(=O)C=C4[C@]3(C)CC[C@@]21C)C(=O)OC
InChI Key InChIKey=JFACETXYABVHFD-WXPPGMDDSA-N
Data  4 KI  4 IC50  1 Kd
  Tab Delimited (TSV)   2D SDfile   Computed 3D by Vconf -m prep SDfile
Find this compound or compounds like it in BindingDB:
Activity Spreadsheet -- Enzyme Inhibition Constant Data from BindingDB
Found 1 hit for monomerid = 50481947
TargetNuclear receptor subfamily 4 group A member 1(Homo sapiens (Human))
Xiamen University
Curated by ChEMBL
LigandPNGBDBM50481947(CHEBI:8416 | GNF-Pf-476 | PRISTIMERIN | Pristimeri...)
Affinity DataKd:  960nM. Assay description: Binding affinity to recombinant human N-terminal His-tagged Nur77 LBD (367 to 598 residues) expressed in Escherichia coli BL21(DE3) incubated for 30 ...
In DepthDetails ArticlePubMed