BDBM50586260 CHEMBL5079910
SMILES Cc1nccc(c1F)-c1cc2[nH]nc(N[C@H]3CCNC[C@@H]3F)c2cc1C1CC1
InChI Key InChIKey=XZAOOSGKUBHZSY-ROUUACIJSA-N
Data  5 IC50
  Tab Delimited (TSV)   2D SDfile   Computed 3D by Vconf -m prep SDfile
Find this compound or compounds like it in BindingDB:
Activity Spreadsheet -- Enzyme Inhibition Constant Data from BindingDB
Found 5 hits for monomerid = 50586260
TargetToll-like receptor 8(Homo sapiens (Human))
Novartis Institutes For Biomedical Research
Curated by ChEMBL
LigandPNGBDBM50586260(CHEMBL5079910)
Affinity DataIC50:  2.40nM. Assay description: Antagonist activity at human TLR8 expressed in Drosophila S2 by TR-FRET assay
Ligand InfoPC cidPC sid
In DepthDetails ArticlePubMed
TargetPotassium voltage-gated channel subfamily H member 2(Homo sapiens (Human))
Novartis Institutes For Biomedical Research
Curated by ChEMBL
LigandPNGBDBM50586260(CHEMBL5079910)
Affinity DataIC50:  1.90E+4nM. Assay description: Inhibition of human ERG
Ligand InfoPC cidPC sid
In DepthDetails ArticlePubMed
TargetToll-like receptor 7(Homo sapiens (Human))
Novartis Institutes For Biomedical Research
Curated by ChEMBL
LigandPNGBDBM50586260(CHEMBL5079910)
Affinity DataIC50:  0.100nM. Assay description: Antagonist activity at human TLR7 expressed in human PBMC cells assessed as inhibition of ssRNA stimulated IFNalpha level preincubated for 30 mins fo...
Ligand InfoPC cidPC sid
In DepthDetails ArticlePubMed
TargetToll-like receptor 8(Homo sapiens (Human))
Novartis Institutes For Biomedical Research
Curated by ChEMBL
LigandPNGBDBM50586260(CHEMBL5079910)
Affinity DataIC50:  0.200nM. Assay description: Antagonist activity at human TLR8 expressed in human PBMC cells assessed as inhibition of ssRNA stimulated TNF level preincubated for 30 mins followe...
Ligand InfoPC cidPC sid
In DepthDetails ArticlePubMed
TargetCytochrome P450 3A4(Homo sapiens (Human))
Novartis Institutes For Biomedical Research
Curated by ChEMBL
LigandPNGBDBM50586260(CHEMBL5079910)
Affinity DataIC50:  4.50E+3nM. Assay description: Inhibition of CYP3A4 (unknown origin)
Ligand InfoPC cidPC sid
In DepthDetails ArticlePubMed