BDBM533041 US10626094, Example I39::US11220486, Compound G58::US11220486, Compound I39::[(3-{[2-(4-methoxyphenyl)(4- quinolyl)]amino}phenyl)methyl]dimethylamine
SMILES COc1ccc(cc1)-c1cc(Nc2cccc(CN(C)C)c2)c2ccccc2n1
InChI Key InChIKey=WHOMTUDXENJOIY-UHFFFAOYSA-N
Data  4 IC50
  Tab Delimited (TSV)   2D SDfile   Computed 3D by Vconf -m prep SDfile
Find this compound or compounds like it in BindingDB:
Activity Spreadsheet -- Enzyme Inhibition Constant Data from BindingDB
Found 4 hits for monomerid = 533041
TargetLow molecular weight phosphotyrosine protein phosphatase(Homo sapiens (Human))
La Jolla Institute of Allergy & Immunology
US Patent
LigandPNGBDBM533041(US10626094, Example I39 | US11220486, Compound G58...)
Affinity DataIC50:  500nM. Assay description: A listing of materials is provided: Item, source, catalog no. LMPTP-A Enzyme Stock Solution (4.22 mg/ml or 206.8 μM), SBMRI Protei...
Ligand InfoPC cidPC sid
In DepthDetails US Patent
TargetPotassium channel subfamily K member 2(Homo sapiens (Human))
Sanford Burnham Prebys Medical Discovery Institute
US Patent
LigandPNGBDBM533041(US10626094, Example I39 | US11220486, Compound G58...)
Affinity DataIC50:  2.90E+3nM. Assay description: 1. Prepare Reagents as described in section F. Recipe.2. Using LabCyte Echo, transfer 60 nL from 2 mM test compound source plate into assay plate Col...
Ligand InfoPC cidPC sid
In DepthDetails US Patent
TargetPotassium channel subfamily K member 2(Homo sapiens (Human))
Sanford Burnham Prebys Medical Discovery Institute
US Patent
LigandPNGBDBM533041(US10626094, Example I39 | US11220486, Compound G58...)
Affinity DataIC50:  500nM. Assay description: 1. Prepare Reagents as described in section F. Recipe.2. Using LabCyte Echo, transfer 60 nL from 2 mM test compound source plate into assay plate Col...
Ligand InfoPC cidPC sid
In DepthDetails US Patent
TargetLow molecular weight phosphotyrosine protein phosphatase(Homo sapiens (Human))
La Jolla Institute of Allergy & Immunology
US Patent
LigandPNGBDBM533041(US10626094, Example I39 | US11220486, Compound G58...)
Affinity DataIC50:  2.90E+3nM. Assay description: A listing of materials is provided: Item, source, catalog no. LMPTP-A Enzyme Stock Solution (4.22 mg/ml or 206.8 μM), SBMRI Protei...
Ligand InfoPC cidPC sid
In DepthDetails US Patent