BDBM533265 N-(3-aminopropyl)(4-{4-[(3- piperidylpropyl)amino](2- quinolyl)}phenyl)carboxamide::US10626094, Example I195::US11220486, Compound I195
SMILES NCCCNC(=O)c1ccc(cc1)-c1cc(NCCCC2CCCNC2)c2ccccc2n1
InChI Key InChIKey=SDFCKQNSMPHIHS-UHFFFAOYSA-N
Data  2 IC50
  Tab Delimited (TSV)   2D SDfile   Computed 3D by Vconf -m prep SDfile
Find this compound or compounds like it in BindingDB:
Activity Spreadsheet -- Enzyme Inhibition Constant Data from BindingDB
Found 2 hits for monomerid = 533265
TargetPotassium channel subfamily K member 2(Homo sapiens (Human))
Sanford Burnham Prebys Medical Discovery Institute
US Patent
LigandPNGBDBM533265(N-(3-aminopropyl)(4-{4-[(3- piperidylpropyl)amino]...)
Affinity DataIC50:  500nM. Assay description: 1. Prepare Reagents as described in section F. Recipe.2. Using LabCyte Echo, transfer 60 nL from 2 mM test compound source plate into assay plate Col...
Ligand InfoPC cidPC sid
In DepthDetails US Patent
TargetLow molecular weight phosphotyrosine protein phosphatase(Homo sapiens (Human))
La Jolla Institute of Allergy & Immunology
US Patent
LigandPNGBDBM533265(N-(3-aminopropyl)(4-{4-[(3- piperidylpropyl)amino]...)
Affinity DataIC50:  500nM. Assay description: A listing of materials is provided: Item, source, catalog no. LMPTP-A Enzyme Stock Solution (4.22 mg/ml or 206.8 μM), SBMRI Protei...
Ligand InfoPC cidPC sid
In DepthDetails US Patent