BDBM57106 Hydroxy-bis-(3-trifluoromethyl-phenyl)-acetic acid N'-(2-bromo-phenyl)-hydrazide::MLS000554211::N'-(2-bromophenyl)-2-hydroxy-2,2-bis[3-(trifluoromethyl)phenyl]acetohydrazide::N'-(2-bromophenyl)-2-oxidanyl-2,2-bis[3-(trifluoromethyl)phenyl]ethanehydrazide::SMR000146528::cid_1896987
SMILES OC(C(=O)NNc1ccccc1Br)(c1cccc(c1)C(F)(F)F)c1cccc(c1)C(F)(F)F
InChI Key InChIKey=CTNSEDNBMDZZNT-UHFFFAOYSA-N
Data  3 IC50  1 EC50
  Tab Delimited (TSV)   2D SDfile   Computed 3D by Vconf -m prep SDfile
Find this compound or compounds like it in BindingDB:
Activity Spreadsheet -- Enzyme Inhibition Constant Data from BindingDB
Found 3 hits for monomerid = 57106
TargetDNA damage-inducible transcript 3 protein(Mus musculus)
Emory University
Curated by PubChem BioAssay
LigandPNGBDBM57106(Hydroxy-bis-(3-trifluoromethyl-phenyl)-acetic acid...)
Affinity DataIC50:  2.08E+3nM. Assay description: NIH Molecular Libraries Screening Centers Network [MLSCN] Emory Chemical Biology Discovery Center in MLSCN Assay provider: Dr. Randal Kaufman, Univer...
In DepthDetails PCBioAssay
TargetX-box-binding protein 1(Homo sapiens (Human))
Emory University
Curated by PubChem BioAssay
LigandPNGBDBM57106(Hydroxy-bis-(3-trifluoromethyl-phenyl)-acetic acid...)
Affinity DataIC50:  5.68E+3nM. Assay description: NIH Molecular Libraries Screening Centers Network [MLSCN] Emory Chemical Biology Discovery Center in MLSCN Assay provider: Dr. Randal Kaufman, Univer...
In DepthDetails PCBioAssay
TargetDNA damage-inducible transcript 3 protein(Mus musculus)
Emory University
Curated by PubChem BioAssay
LigandPNGBDBM57106(Hydroxy-bis-(3-trifluoromethyl-phenyl)-acetic acid...)
Affinity DataIC50:  2.08E+3nM. Assay description: NIH Molecular Libraries Screening Centers Network [MLSCN] Emory Chemical Biology Discovery Center in MLSCN Assay provider: Dr. Randal Kaufman, Univer...
In DepthDetails PCBioAssay