BDBM58117 1-(2-Hydroxy-ethylamino)-9,10-dioxo-9,10-dihydro-anthracene-2-carboxylic acid (2-diethylamino-ethyl)-amide::MLS000770002::N-[2-(diethylamino)ethyl]-1-(2-hydroxyethylamino)-9,10-bis(oxidanylidene)anthracene-2-carboxamide::N-[2-(diethylamino)ethyl]-1-(2-hydroxyethylamino)-9,10-diketo-anthracene-2-carboxamide::N-[2-(diethylamino)ethyl]-1-(2-hydroxyethylamino)-9,10-dioxo-2-anthracenecarboxamide::N-[2-(diethylamino)ethyl]-1-(2-hydroxyethylamino)-9,10-dioxoanthracene-2-carboxamide::SMR000434735::cid_3737083
SMILES CCN(CC)CCNC(=O)c1ccc2C(=O)c3ccccc3C(=O)c2c1NCCO
InChI Key InChIKey=AQTIOANXHLOZDH-UHFFFAOYSA-N
Data  1 IC50  1 EC50
  Tab Delimited (TSV)   2D SDfile   Computed 3D by Vconf -m prep SDfile
Find this compound or compounds like it in BindingDB:
Activity Spreadsheet -- Enzyme Inhibition Constant Data from BindingDB
Found 1 hit for monomerid = 58117
TargetStreptokinase A(Streptococcus pyogenes M1 GAS)
Broad Institute
Curated by PubChem BioAssay
LigandPNGBDBM58117(1-(2-Hydroxy-ethylamino)-9,10-dioxo-9,10-dihydro-a...)
Affinity DataEC50:  1.50E+5nM. Assay description: Keywords: Group A streptococcus, GAS, streptokinase, expression, virulence, inhibition, dose response, EC50 Assay Overview: The goal of this assa...
In DepthDetails PCBioAssay