BDBM615842 US20230271954, Compound 141::trans-8-((-4-((cyclobutylmethyl)(6-fluoro-4- methylpyridin-3-yl)amino)cyclohexyl)(methyl) amino)-5-methyl-6-oxo-5,6-dihydro-1,5- naphthyridine-2,7-dicarbonitrile
SMILES Cc1cc(F)ncc1N(CC1CCC1)[C@H]1CC[C@H](CNc2c(C#N)c(=O)n(C)c3ccc(nc23)C#N)CC1
InChI Key InChIKey=QABSWTALOHNCRE-XYWHTSSQSA-N
Data  2 IC50
  Tab Delimited (TSV)   2D SDfile   Computed 3D by Vconf -m prep SDfile
Find this compound or compounds like it in BindingDB:
Activity Spreadsheet -- Enzyme Inhibition Constant Data from BindingDB
Found 2 hits for monomerid = 615842
TargetDiacylglycerol kinase alpha(Homo sapiens)
Gossamer Bio Services
US Patent
LigandPNGBDBM615842(US20230271954, Compound 141 | trans-8-((-4-((cyclo...)
Affinity DataIC50:  55nM. Assay description: Compounds of the present invention were prepared into 10 mM DMSO solution and 10 nL of stock was transferred into 384 plates (Optiplate 384 plate) us...
Ligand InfoPC cidPC sid
In DepthDetails US Patent
TargetDiacylglycerol kinase zeta(Homo sapiens)
Gossamer Bio Services
US Patent
LigandPNGBDBM615842(US20230271954, Compound 141 | trans-8-((-4-((cyclo...)
Affinity DataIC50: <10nM. Assay description: Compounds of the present invention were prepared into 10 mM DMSO solution and 10 nL of stock was transferred into 384 plates (Optiplate 384 plate) us...
Ligand InfoPC cidPC sid
In DepthDetails US Patent