Target
Receptor protein-tyrosine kinase
Ligand
BDBM276743
Substrate
Meas. Tech.
Human, Dog and Rat c-Fms Enzyme Assay (Fluorescence Immunoassay Format)
IC50
16.0±n/a nM
Citation
 Chen, JDonahue, MLim, HLin, RSalter, RWu, JGong, Y Substituted pyridine derivatives useful as C-FMS kinase inhibitors US Patent  US11214566 Publication Date 1/4/2022 
Target
Name:
Receptor protein-tyrosine kinase
Synonyms:
A0A8C0LZB8_CANLF Colony stimulating factor 1 receptor
Type:
Protein
Mol. Mass.:
110154.61
Organism:
Dog
Description:
A0A8C0LZB8
Residue:
1003
  
Inhibitor
Name:
BDBM276743
Synonyms:
US10071991, Compound (P) US11214566, Compound (P) | US9611259, Compound (P)
Type:
Small organic molecule
Emp. Form.:
C27H35N5O2
Mol. Mass.:
461.5991
SMILES:
CC1(C)CCC(=CC1)c1nc(ccc1NC(=O)c1nc(c[nH]1)C#N)C1CC(C)(C)OC(C)(C)C1
: