Target
Sodium/glucose cotransporter 1
Ligand
BDBM20875
Substrate
BDBM20876
Meas. Tech.
SGLT Binding Assay
pH
7.2±n/a
Temperature
295.15±n/a K
EC50
330±50 nM
Citation
 Meng, WEllsworth, BANirschl, AAMcCann, PJPatel, MGirotra, RNWu, GSher, PMMorrison, EPBiller, SAZahler, RDeshpande, PPPullockaran, AHagan, DLMorgan, NTaylor, JRObermeier, MTHumphreys, WGKhanna, ADiscenza, LRobertson, JGWang, AHan, SWetterau, JRJanovitz, EBFlint, OPWhaley, JMWashburn, WN Discovery of Dapagliflozin: A Potent, Selective Renal Sodium-Dependent Glucose Cotransporter 2 (SGLT2) Inhibitor for the Treatment of Type 2 Diabetes. J Med Chem 51:1145-9 (2008)  
Target
Name:
Sodium/glucose cotransporter 1
Synonyms:
High affinity sodium-glucose cotransporter Na(+)/glucose cotransporter 1 SGLT1 Sodium-dependent glucose cotransporter 1 (SGLT1) Sodium/glucose cotransporter 1 (SGLT1) | Solute carrier family 5 member 1
Type:
Protein
Mol. Mass.:
73503.78
Organism:
Homo sapiens (Human)
Description:
P13866
Residue:
664
  
Inhibitor
Name:
BDBM20875
Synonyms:
1-(2,4-dihydroxy-6-{[(2S,3R,4S,5S,6R)-3,4,5-trihydroxy-6-(hydroxymethyl)oxan-2-yl]oxy}phenyl)-3-(4-hydroxyphenyl)propan-1-one CHEMBL245067 O-glucoside, 1 | Phlorizin
Type:
Natural product
Emp. Form.:
C21H24O10
Mol. Mass.:
436.4093
SMILES:
OC[C@H]1O[C@@H](Oc2cc(O)cc(O)c2C(=O)CCc2ccc(O)cc2)[C@H](O)[C@@H](O)[C@@H]1O
:
Substrate
Name:
BDBM20876
Synonyms:
(2R,3S,4S,5R,6S)-2-(hydroxymethyl)-6-methoxyoxane-3,4,5-triol alpha-methyl-D-glucopyranoside (AMG)
Type:
Carbonhydrate
Emp. Form.:
C7H14O6
Mol. Mass.:
194.1825
SMILES:
CO[C@H]1O[C@H](CO)[C@@H](O)[C@H](O)[C@H]1O
: