Target
Peroxisome proliferator-activated receptor alpha
Ligand
BDBM28700
Substrate
BDBM10852
Meas. Tech.
Cell-Based Transcription Assay
EC50
30000±n/a nM
Citation
 Sierra, MLBeneton, VBoullay, ABBoyer, TBrewster, AGDonche, FForest, MCFouchet, MHGellibert, FJGrillot, DALambert, MHLaroze, ALe Grumelec, CLinget, JMMontana, VGNguyen, VLNicodème, EPatel, VPenfornis, APineau, OPohin, DPotvain, FPoulain, GRuault, CBSaunders, MToum, JXu, HEXu, RXPianetti, PM Substituted 2-[(4-aminomethyl)phenoxy]-2-methylpropionic acid PPARalpha agonists. 1. Discovery of a novel series of potent HDLc raising agents. J Med Chem 50:685-95 (2007)  
Target
Name:
Peroxisome proliferator-activated receptor alpha
Synonyms:
NR1C1 PPAR PPAR-alpha PPARA_HUMAN Peroxisome proliferator-activated receptor | Peroxisome proliferator-activated receptor alpha (PPAR alpha)
Type:
Enzyme
Mol. Mass.:
52222.08
Organism:
Homo sapiens (Human)
Description:
Q07869
Residue:
468
  
Inhibitor
Name:
BDBM28700
Synonyms:
2-(4-(4-Chlorobenzoyl)phenoxy)-2-methylpropionic acid CHEMBL981 FIBRICOR LF 153 procetofenic acid
Type:
Small organic molecule
Emp. Form.:
C17H15ClO4
Mol. Mass.:
318.752
SMILES:
CC(C)(Oc1ccc(cc1)C(=O)c1ccc(Cl)cc1)C(O)=O
:
Substrate