Target
E3 ubiquitin-protein ligase Mdm2
Ligand
BDBM31282
Substrate
BDBM10852
Meas. Tech.
NMR Titration Experiment
pH
7.4±n/a
Temperature
296.15±n/a K
Kd
250000±n/a nM
Citation
 Stoll, RRenner, CHansen, SPalme, SKlein, CBelling, AZeslawski, WKamionka, MRehm, TMühlhahn, PSchumacher, RHesse, FKaluza, BVoelter, WEngh, RAHolak, TA Chalcone derivatives antagonize interactions between the human oncoprotein MDM2 and p53. Biochemistry 40:336-44 (2001)  
Target
Name:
E3 ubiquitin-protein ligase Mdm2
Synonyms:
Double minute 2 protein E3 ubiquitin-protein ligase Mdm2 (p53-binding protein Mdm2) Human Double Minute 2 (HDM2) MDM2-MDMX p53-Binding Protein MDM2 | p53-binding protein
Type:
Oncoprotein
Mol. Mass.:
55196.54
Organism:
Homo sapiens (Human)
Description:
Q00987
Residue:
491
  
Inhibitor
Name:
BDBM31282
Synonyms:
Chalcone derivative, L
Type:
Small organic molecule
Emp. Form.:
C13H16Cl2O3
Mol. Mass.:
291.17
SMILES:
CCC(C)Cc1ccc(OCC(O)=O)c(Cl)c1Cl
:
Substrate