Target
Heat shock protein HSP 90-alpha
Ligand
BDBM50274535
Substrate
Meas. Tech.
ChEMBL_1714080 (CHEMBL4124129)
Kd
1.5±n/a nM
Citation
 Rondanin, RLettini, GOliva, PBaruchello, RCostantini, CTrapella, CSimoni, DBernardi, TSisinni, LPietrafesa, MPonterini, GCosti, MPVignudelli, TLuciani, RMatassa, DSEsposito, FLandriscina, M New TRAP1 and Hsp90 chaperone inhibitors with cationic components: Preliminary studies on mitochondrial targeting. Bioorg Med Chem Lett 28:2289-2293 (2018)  
Target
Name:
Heat shock protein HSP 90-alpha
Synonyms:
HS90A_HUMAN HSP86 HSP90AA1 HSPCA Heat shock 86 kDa Heat shock protein HSP 90-alpha (HSP90) LAP-2 Lipopolysaccharide-associated protein 2 heat shock protein 90kDa alpha (cytosolic), class A member 1 isoform 2
Type:
Molecular Chaperone
Mol. Mass.:
84623.45
Organism:
Homo sapiens (Human)
Description:
P07900
Residue:
732
  
Inhibitor
Name:
BDBM50274535
Synonyms:
CHEMBL4126250
Type:
Small organic molecule
Emp. Form.:
C24H26N6O6
Mol. Mass.:
494.4998
SMILES:
CCNC(=O)c1noc(c1NC(=O)c1ccc(cc1)C(=O)NC(N)=N)-c1cc(C(C)C)c(O)cc1O
: