Target
Histone deacetylase 1
Ligand
BDBM50292317
Substrate
Meas. Tech.
ChEBML_1731841
IC50
27±n/a nM
Citation
 Aboeldahab, AMABeshr, EAMShoman, MERabea, SMAly, OM Spirohydantoins and 1,2,4-triazole-3-carboxamide derivatives as inhibitors of histone deacetylase: Design, synthesis, and biological evaluation. Eur J Med Chem 146:79-92 (2018)  
Target
Name:
Histone deacetylase 1
Synonyms:
Cereblon/Histone deacetylase 1 HDAC1 Histone deacetylase 1 (HDAC1) RPD3L1
Type:
Enzyme
Mol. Mass.:
55090.27
Organism:
Homo sapiens (Human)
Description:
Q13547
Residue:
482
  
Inhibitor
Name:
BDBM50292317
Synonyms:
CHEMBL4172557
Type:
Small organic molecule
Emp. Form.:
C19H25N3O4
Mol. Mass.:
359.4195
SMILES:
ONC(=O)CCCCCCN1C(=O)NC2(CCCc3ccccc23)C1=O
: