Target
Histone deacetylase 1
Ligand
BDBM50292318
Substrate
Meas. Tech.
ChEBML_1731841
IC50
58±n/a nM
Citation
 Aboeldahab, AMABeshr, EAMShoman, MERabea, SMAly, OM Spirohydantoins and 1,2,4-triazole-3-carboxamide derivatives as inhibitors of histone deacetylase: Design, synthesis, and biological evaluation. Eur J Med Chem 146:79-92 (2018)  
Target
Name:
Histone deacetylase 1
Synonyms:
Cereblon/Histone deacetylase 1 HDAC1 Histone deacetylase 1 (HDAC1) RPD3L1
Type:
Enzyme
Mol. Mass.:
55090.27
Organism:
Homo sapiens (Human)
Description:
Q13547
Residue:
482
  
Inhibitor
Name:
BDBM50292318
Synonyms:
CHEMBL4174925
Type:
Small organic molecule
Emp. Form.:
C21H23N5O7
Mol. Mass.:
457.4366
SMILES:
COc1cccc(c1)-n1nc(nc1-c1cc(OC)c(OC)c(OC)c1)C(=O)NCC(=O)NO
: