Target
Histone deacetylase 6
Ligand
BDBM50292317
Substrate
Meas. Tech.
ChEBML_1731844
IC50
261±n/a nM
Citation
 Aboeldahab, AMABeshr, EAMShoman, MERabea, SMAly, OM Spirohydantoins and 1,2,4-triazole-3-carboxamide derivatives as inhibitors of histone deacetylase: Design, synthesis, and biological evaluation. Eur J Med Chem 146:79-92 (2018)  
Target
Name:
Histone deacetylase 6
Synonyms:
Cereblon/Histone deacetylase 6 HDAC6 Histone deacetylase 6 (HDAC6) KIAA0901 | ORF Names:JM21
Type:
Chromatin regulator; hydrolase; repressor
Mol. Mass.:
131381.51
Organism:
Homo sapiens (Human)
Description:
Q9UBN7
Residue:
1215
  
Inhibitor
Name:
BDBM50292317
Synonyms:
CHEMBL4172557
Type:
Small organic molecule
Emp. Form.:
C19H25N3O4
Mol. Mass.:
359.4195
SMILES:
ONC(=O)CCCCCCN1C(=O)NC2(CCCc3ccccc23)C1=O
: