Target
Histone deacetylase 4
Ligand
BDBM50292331
Substrate
Meas. Tech.
ChEMBL_1731843 (CHEMBL4147379)
IC50
180±n/a nM
Citation
 Aboeldahab, AMABeshr, EAMShoman, MERabea, SMAly, OM Spirohydantoins and 1,2,4-triazole-3-carboxamide derivatives as inhibitors of histone deacetylase: Design, synthesis, and biological evaluation. Eur J Med Chem 146:79-92 (2018)  
Target
Name:
Histone deacetylase 4
Synonyms:
Cereblon/Histone deacetylase 4 HDAC4 Histone acetylase 4(HDAC4) KIAA0288
Type:
Enzyme
Mol. Mass.:
119049.39
Organism:
Homo sapiens (Human)
Description:
P56524
Residue:
1084
  
Inhibitor
Name:
BDBM50292331
Synonyms:
CHEMBL4168150
Type:
Small organic molecule
Emp. Form.:
C25H31N5O7
Mol. Mass.:
513.5429
SMILES:
COc1cccc(c1)-n1nc(nc1-c1cc(OC)c(OC)c(OC)c1)C(=O)NCCCCCC(=O)NO
: