Target
Histone deacetylase 4
Ligand
BDBM50292317
Substrate
Meas. Tech.
ChEMBL_1731843 (CHEMBL4147379)
IC50
99±n/a nM
Citation
 Aboeldahab, AMABeshr, EAMShoman, MERabea, SMAly, OM Spirohydantoins and 1,2,4-triazole-3-carboxamide derivatives as inhibitors of histone deacetylase: Design, synthesis, and biological evaluation. Eur J Med Chem 146:79-92 (2018)  
Target
Name:
Histone deacetylase 4
Synonyms:
Cereblon/Histone deacetylase 4 HDAC4 Histone acetylase 4(HDAC4) KIAA0288
Type:
Enzyme
Mol. Mass.:
119049.39
Organism:
Homo sapiens (Human)
Description:
P56524
Residue:
1084
  
Inhibitor
Name:
BDBM50292317
Synonyms:
CHEMBL4172557
Type:
Small organic molecule
Emp. Form.:
C19H25N3O4
Mol. Mass.:
359.4195
SMILES:
ONC(=O)CCCCCCN1C(=O)NC2(CCCc3ccccc23)C1=O
: