Target
Mitogen-activated protein kinase kinase kinase kinase 2
Ligand
BDBM50459204
Substrate
Meas. Tech.
ChEMBL_1765762 (CHEMBL4201009)
IC50
165±n/a nM
Citation
 Cho, HShin, IJu, EChoi, SHur, WKim, HHong, EKim, NDChoi, HGGray, NSSim, T First SAR Study for Overriding NRAS Mutant Driven Acute Myeloid Leukemia. J Med Chem 61:8353-8373 (2018)  
Target
Name:
Mitogen-activated protein kinase kinase kinase kinase 2
Synonyms:
2.7.11.1 GC kinase Germinal center kinase MAP4K2 MEK kinase kinase 2 RAB8IP | Rab8-interacting protein
Type:
Mol. Mass.:
91551.35
Organism:
Homo sapiens (Human)
Description:
Residue:
820
  
Inhibitor
Name:
BDBM50459204
Synonyms:
CHEMBL4206139
Type:
Small organic molecule
Emp. Form.:
C35H30F3N7O2
Mol. Mass.:
637.6536
SMILES:
Cc1ccc(Nc2ncc3CN(C(=O)N(Cc4ccccc4)c3n2)c2cc(NC(=O)c3ccc(C)c(c3)C(F)(F)F)ccc2C)cn1
: