Target
Mitogen-activated protein kinase kinase kinase kinase 2
Ligand
BDBM50459216
Substrate
Meas. Tech.
ChEMBL_1765762 (CHEMBL4201009)
IC50
5.0±n/a nM
Citation
 Cho, HShin, IJu, EChoi, SHur, WKim, HHong, EKim, NDChoi, HGGray, NSSim, T First SAR Study for Overriding NRAS Mutant Driven Acute Myeloid Leukemia. J Med Chem 61:8353-8373 (2018)  
Target
Name:
Mitogen-activated protein kinase kinase kinase kinase 2
Synonyms:
2.7.11.1 GC kinase Germinal center kinase MAP4K2 MEK kinase kinase 2 RAB8IP | Rab8-interacting protein
Type:
Mol. Mass.:
91551.35
Organism:
Homo sapiens (Human)
Description:
Residue:
820
  
Inhibitor
Name:
BDBM50459216
Synonyms:
CHEMBL4213673
Type:
Small organic molecule
Emp. Form.:
C27H25F3N8O2
Mol. Mass.:
550.535
SMILES:
CN1C(=O)N(Cc2cnc(Nc3cc(C)nn3C)nc12)c1cc(NC(=O)c2cccc(c2)C(F)(F)F)ccc1C
: