Target
Mitogen-activated protein kinase kinase kinase kinase 2
Ligand
BDBM50459221
Substrate
Meas. Tech.
ChEMBL_1765762 (CHEMBL4201009)
IC50
16±n/a nM
Citation
 Cho, HShin, IJu, EChoi, SHur, WKim, HHong, EKim, NDChoi, HGGray, NSSim, T First SAR Study for Overriding NRAS Mutant Driven Acute Myeloid Leukemia. J Med Chem 61:8353-8373 (2018)  
Target
Name:
Mitogen-activated protein kinase kinase kinase kinase 2
Synonyms:
2.7.11.1 GC kinase Germinal center kinase MAP4K2 MEK kinase kinase 2 RAB8IP | Rab8-interacting protein
Type:
Mol. Mass.:
91551.35
Organism:
Homo sapiens (Human)
Description:
Residue:
820
  
Inhibitor
Name:
BDBM50459221
Synonyms:
CHEMBL4216786
Type:
Small organic molecule
Emp. Form.:
C40H46F3N11O3
Mol. Mass.:
785.8603
SMILES:
CN(C)C1CCN(Cc2ccc(cc2C(F)(F)F)C(=O)Nc2ccc(C)c(c2)N2Cc3cnc(Nc4ccc(nc4)N4CCN(CC4)C(C)=O)nc3N(C)C2=O)C1
: