Target
Retinoic acid receptor RXR-alpha
Ligand
BDBM50032220
Substrate
Meas. Tech.
ChEMBL_196751 (CHEMBL803332)
EC50
11±n/a nM
Citation
 Beard, RLChandraratna, RAColon, DFGillett, SJHenry, EMarler, DKSong, TDenys, LGarst, MEArefieg, T Synthesis and structure-activity relationships of stilbene retinoid analogs substituted with heteroaromatic carboxylic acids. J Med Chem 38:2820-9 (1995)  
Target
Name:
Retinoic acid receptor RXR-alpha
Synonyms:
NR2B1 Nuclear receptor subfamily 4 group A member 2 RXRA Retinoic acid receptor RXR-alpha/gamma Retinoid receptor
Type:
PROTEIN
Mol. Mass.:
50820.38
Organism:
Homo sapiens (Human)
Description:
ChEMBL_1456363
Residue:
462
  
Inhibitor
Name:
BDBM50032220
Synonyms:
5-[(E)-2-(3,5,5,8,8-Pentamethyl-5,6,7,8-tetrahydro-naphthalen-2-yl)-propenyl]-thiophene-2-carboxylic acid | CHEMBL91718
Type:
Small organic molecule
Emp. Form.:
C23H28O2S
Mol. Mass.:
368.532
SMILES:
C\C(=C/c1ccc(s1)C(O)=O)c1cc2c(cc1C)C(C)(C)CCC2(C)C
: