Target
Heat shock protein HSP 90-alpha
Ligand
BDBM50495252
Substrate
Meas. Tech.
ChEMBL_1284217 (CHEMBL3107812)
Kd
1.4±n/a nM
Citation
 Suda, AKawasaki, KKomiyama, SIsshiki, YYoon, DOKim, SJNa, YJHasegawa, KFukami, TASato, SMiura, TOno, NYamazaki, TSaitoh, RShimma, NShiratori, YTsukuda, T Design and synthesis of 2-amino-6-(1H,3H-benzo[de]isochromen-6-yl)-1,3,5-triazines as novel Hsp90 inhibitors. Bioorg Med Chem 22:892-905 (2014)  
Target
Name:
Heat shock protein HSP 90-alpha
Synonyms:
HS90A_HUMAN HSP86 HSP90AA1 HSPCA Heat shock 86 kDa Heat shock protein HSP 90-alpha (HSP90) LAP-2 Lipopolysaccharide-associated protein 2 heat shock protein 90kDa alpha (cytosolic), class A member 1 isoform 2
Type:
Molecular Chaperone
Mol. Mass.:
84623.45
Organism:
Homo sapiens (Human)
Description:
P07900
Residue:
732
  
Inhibitor
Name:
BDBM50495252
Synonyms:
CHEMBL3104274
Type:
Small organic molecule
Emp. Form.:
C18H17ClN6O2S
Mol. Mass.:
416.885
SMILES:
NC(=O)NCCSc1nc(N)nc(n1)-c1c(Cl)cc2COCc3cccc1c23
: