Target
Chymase
Ligand
BDBM50059002
Substrate
Meas. Tech.
ChEMBL_49438 (CHEMBL885061)
IC50
66.0±n/a nM
Citation
 Niwata, SFukami, HSumida, MIto, AKakutani, SSaitoh, MSuzuki, KImoto, MShibata, HImajo, SKiso, YTanaka, TNakazato, HIshihara, TTakai, SYamamoto, DShiota, NMiyazaki, MOkunishi, HKinoshita, AUrata, HArakawa, K Substituted 3-(phenylsulfonyl)-1-phenylimidazolidine-2,4-dione derivatives as novel nonpeptide inhibitors of human heart chymase. J Med Chem 40:2156-63 (1997)  
Target
Name:
Chymase
Synonyms:
Alpha-chymase CMA1_HUMAN CYM Mast cell protease I
Type:
Enzyme
Mol. Mass.:
27340.12
Organism:
Homo sapiens (Human)
Description:
Residue:
247
  
Inhibitor
Name:
BDBM50059002
Synonyms:
3-(4-Chloro-benzenesulfonyl)-1-(3-chloro-phenyl)-imidazolidine-2,4-dione | CHEMBL69969
Type:
Small organic molecule
Emp. Form.:
C15H10Cl2N2O4S
Mol. Mass.:
385.222
SMILES:
Clc1ccc(cc1)S(=O)(=O)N1C(=O)CN(C1=O)c1cccc(Cl)c1
: