Target
Peptidyl-prolyl cis-trans isomerase FKBP1A
Ligand
BDBM50080528
Substrate
Meas. Tech.
ChEMBL_66270 (CHEMBL678140)
IC50
3600±n/a nM
Citation
 Christner, CWyrwa, RMarsch, SKüllertz, GThiericke, RGrabley, SSchumann, DFischer, G Synthesis and cytotoxic evaluation of cycloheximide derivatives as potential inhibitors of FKBP12 with neuroregenerative properties. J Med Chem 42:3615-22 (1999)  
Target
Name:
Peptidyl-prolyl cis-trans isomerase FKBP1A
Synonyms:
12 kDa FK506-binding protein FK506-binding protein 1A FKB1A_HUMAN FKBP-1A FKBP12 Immunophilin FKBP12 PPIase FKBP1A Rotamase mTOR/FKBP12A/FKBP12B
Type:
Isomerase
Mol. Mass.:
11953.09
Organism:
Homo sapiens (Human)
Description:
P62942
Residue:
108
  
Inhibitor
Name:
BDBM50080528
Synonyms:
3-((R)-2-((1S,3S,5S)-3,5-dimethyl-2-oxocyclohexyl)-2-hydroxyethyl)glutarimide CHEMBL123292 Zykloheximid cycloheximide | med.21724, Compound Cycloheximide
Type:
Small organic molecule
Emp. Form.:
C15H23NO4
Mol. Mass.:
281.3474
SMILES:
C[C@H]1C[C@H](C)C(=O)[C@@H](C1)[C@H](O)CC1CC(=O)NC(=O)C1
: