Target
Proline--tRNA ligase, cytoplasmic
Ligand
BDBM50097109
Substrate
Meas. Tech.
ChEBML_223470
IC50
1500±n/a nM
Citation
 Yu, XYHill, JMYu, GYang, YKluge, AFKeith, DFinn, JGallant, PSilverman, JLim, A A series of quinoline analogues as potent inhibitors of C. albicans prolyl tRNA synthetase. Bioorg Med Chem Lett 11:541-4 (2001)  
Target
Name:
Proline--tRNA ligase, cytoplasmic
Synonyms:
PRS Proline--tRNA ligase Prolyl-tRNA synthetase, cytoplasmic | SYPC_CANAX
Type:
PROTEIN
Mol. Mass.:
66202.25
Organism:
Candida albicans
Description:
ChEMBL_223470
Residue:
575
  
Inhibitor
Name:
BDBM50097109
Synonyms:
2-(4-Bromo-phenyl)-6-chloro-8-hydroxymethyl-quinoline-4-carboxylic acid | CHEMBL150407
Type:
Small organic molecule
Emp. Form.:
C17H11BrClNO3
Mol. Mass.:
392.631
SMILES:
OCc1cc(Cl)cc2c(cc(nc12)-c1ccc(Br)cc1)C(O)=O
: