Target
Neuromedin-U receptor 2
Ligand
BDBM50542392
Substrate
Meas. Tech.
ChEMBL_1986847 (CHEMBL4620394)
EC50
2.2±n/a nM
Citation
 Takayama, KMori, KTanaka, ASasaki, YSohma, YTaguchi, ATaniguchi, ASakane, TYamamoto, AMiyazato, MMinamino, NKangawa, KHayashi, Y A chemically stable peptide agonist to neuromedin U receptor type 2. Bioorg Med Chem 28:0 (2020)  
Target
Name:
Neuromedin-U receptor 2
Synonyms:
G-protein coupled receptor FM-4 NMU-R2 NMU2R NMUR2_HUMAN TGR1
Type:
PROTEIN
Mol. Mass.:
47710.86
Organism:
Homo sapiens (Human)
Description:
ChEMBL_103075
Residue:
415
  
Inhibitor
Name:
BDBM50542392
Synonyms:
CHEMBL4647192
Type:
Small organic molecule
Emp. Form.:
C40H72N12O8
Mol. Mass.:
849.0753
SMILES:
CC(C)C[C@H](NC(=O)CCC1CCCCC1)C(=O)N[C@@H](CC(C)C)C(=O)N[C@@H](CCN)C(=O)N1CCC[C@H]1C(=O)N[C@@H](CCCNC(N)=N)C(=O)N[C@@H](CC(N)=O)C(N)=O
: