Target
Adenosine receptor A2a
Ligand
BDBM50202986
Substrate
Meas. Tech.
ChEMBL_2197332 (CHEMBL5109848)
Ki
0.500000±n/a nM
Citation
 Bolteau, RDuroux, RLaversin, AVreulz, BShiriaeva, AStauch, BHan, GWCherezov, VRenault, NBarczyk, ARavez, SCoevoet, MMelnyk, PLiberelle, MYous, S High ligand efficiency quinazoline compounds as novel A Eur J Med Chem 241:0 (2022) Target
Name:
Adenosine receptor A2a
Synonyms:
A2A adenosine receptor (hA2A) ADENOSINE A2 ADORA2 Adenosine A2A receptor (A2AAR)
Type:
G Protein-Coupled Receptor (GPCR)
Mol. Mass.:
44716.46
Organism:
Homo sapiens (Human)
Description:
P29274
Residue:
412
  
Inhibitor
Name:
BDBM50202986
Synonyms:
2-furan-2-yl-7-(2-{4-[4-(2-methoxy-ethoxy)-phenyl]-piperazin-1-yl}-ethyl)-2,7-dihydro-3H-pyrazolo[4,3-e][1,2,4]triazolo[1,5-c]pyrimidin-5-ylamine 7-(2-(4-(2,4-difluorophenyl)piperazin-1-yl)ethyl)-2-(furan-2-yl)-7H-pyrazolo[4,3-e][1,2,4]triazolo[1,5-c]pyrimidin-5-amine SCH-420814 US11472811, Example Preladenant | preladenant
Type:
Small organic molecule
Emp. Form.:
C25H29N9O3
Mol. Mass.:
503.5563
SMILES:
COCCOc1ccc(cc1)N1CCN(CCn2ncc3c2nc(N)n2nc(nc32)-c2ccco2)CC1
: