Target
Retinoic acid receptor alpha
Ligand
BDBM31892
Substrate
Meas. Tech.
ChEMBL_2235592 (CHEMBL5149364)
EC50
1.000000±n/a nM
Citation
 Shim, SKrishnaiah, MSankham, MRKim, ILee, YShin, IOh, ARLee, HJVu, TNLPark, JChoi, SPark, SKwon, YFang, SKim, DK Discovery of ( J Med Chem 65:9974-10000 (2022) Target
Name:
Retinoic acid receptor alpha
Synonyms:
NR1B1 RAR-alpha RARA_HUMAN Retinoic acid receptor alpha/Retinoid X receptor alpha Retinoid receptor
Type:
PROTEIN
Mol. Mass.:
50778.87
Organism:
Homo sapiens (Human)
Description:
ChEMBL_1466191
Residue:
462
  
Inhibitor
Name:
BDBM31892
Synonyms:
9-cis retinoic acid CHEMBL705 alitretinoin
Type:
Small organic molecule
Emp. Form.:
C20H28O2
Mol. Mass.:
300.4351
SMILES:
C\C(\C=C\C1=C(C)CCCC1(C)C)=C\C=C\C(\C)=C\C(O)=O
: