Target
Retinoic acid receptor gamma
Ligand
BDBM50290179
Substrate
Meas. Tech.
ChEMBL_196322 (CHEMBL806265)
Kd
17±n/a nM
Citation
 Beard, RLTeng, MColon, DFDuong, TTThacher, SMArefieg, TChandraratna, RA Synthesis and biological activity of 1,2,3,4-tetrahydroquinoline and 3,4-(1H)-dihydroquinolin-2-one analogs of retinoic acid Bioorg Med Chem Lett 7:2373-2378 (1997)    Article 
Target
Name:
Retinoic acid receptor gamma
Synonyms:
NR1B3 RAR-gamma RARG_HUMAN Retinoic acid receptor gamma | Retinoid receptor
Type:
PROTEIN
Mol. Mass.:
50345.43
Organism:
Homo sapiens (Human)
Description:
ChEMBL_1458016
Residue:
454
  
Inhibitor
Name:
BDBM50290179
Synonyms:
4-(1-Isopropyl-4,4-dimethyl-2-oxo-1,2,3,4-tetrahydro-quinolin-6-ylethynyl)-benzoic acid | CHEMBL76313
Type:
Small organic molecule
Emp. Form.:
C23H23NO3
Mol. Mass.:
361.4336
SMILES:
CC(C)N1C(=O)CC(C)(C)c2cc(ccc12)C#Cc1ccc(cc1)C(O)=O
: