Target
Retinoic acid receptor alpha
Ligand
BDBM50290178
Substrate
Meas. Tech.
ChEBML_195466
Kd
58±n/a nM
Citation
 Beard, RLTeng, MColon, DFDuong, TTThacher, SMArefieg, TChandraratna, RA Synthesis and biological activity of 1,2,3,4-tetrahydroquinoline and 3,4-(1H)-dihydroquinolin-2-one analogs of retinoic acid Bioorg Med Chem Lett 7:2373-2378 (1997)    Article 
Target
Name:
Retinoic acid receptor alpha
Synonyms:
NR1B1 RAR-alpha RARA_HUMAN Retinoic acid receptor alpha/Retinoid X receptor alpha Retinoid receptor
Type:
PROTEIN
Mol. Mass.:
50778.87
Organism:
Homo sapiens (Human)
Description:
ChEMBL_1466191
Residue:
462
  
Inhibitor
Name:
BDBM50290178
Synonyms:
4-(1-Isopropyl-4,4-dimethyl-2-oxo-1,2,3,4-tetrahydro-quinolin-7-ylethynyl)-benzoic acid | CHEMBL430616
Type:
Small organic molecule
Emp. Form.:
C23H23NO3
Mol. Mass.:
361.4336
SMILES:
CC(C)N1C(=O)CC(C)(C)c2ccc(cc12)C#Cc1ccc(cc1)C(O)=O
: