Target
Retinoic acid receptor gamma
Ligand
BDBM50290182
Substrate
Meas. Tech.
ChEMBL_196322 (CHEMBL806265)
Kd
>1000±n/a nM
Citation
 Beard, RLTeng, MColon, DFDuong, TTThacher, SMArefieg, TChandraratna, RA Synthesis and biological activity of 1,2,3,4-tetrahydroquinoline and 3,4-(1H)-dihydroquinolin-2-one analogs of retinoic acid Bioorg Med Chem Lett 7:2373-2378 (1997)    Article 
Target
Name:
Retinoic acid receptor gamma
Synonyms:
NR1B3 RAR-gamma RARG_HUMAN Retinoic acid receptor gamma | Retinoid receptor
Type:
PROTEIN
Mol. Mass.:
50345.43
Organism:
Homo sapiens (Human)
Description:
ChEMBL_1458016
Residue:
454
  
Inhibitor
Name:
BDBM50290182
Synonyms:
4-(4,4-Dimethyl-2-oxo-1,2,3,4-tetrahydro-quinolin-7-ylethynyl)-benzoic acid | CHEMBL306999
Type:
Small organic molecule
Emp. Form.:
C20H17NO3
Mol. Mass.:
319.3539
SMILES:
CC1(C)CC(=O)Nc2cc(ccc12)C#Cc1ccc(cc1)C(O)=O
: