Target
DNA (cytosine-5)-methyltransferase 1
Ligand
BDBM50294481
Substrate
Meas. Tech.
ChEMBL_575565 (CHEMBL1036408)
IC50
45000±n/a nM
Citation
 Saavedra, OMIsakovic, LLlewellyn, DBZhan, LBernstein, NClaridge, SRaeppel, FVaisburg, AElowe, NPetschner, AJRahil, JBeaulieu, NMacLeod, ARDelorme, DBesterman, JMWahhab, A SAR around (l)-S-adenosyl-l-homocysteine, an inhibitor of human DNA methyltransferase (DNMT) enzymes. Bioorg Med Chem Lett 19:2747-51 (2009)  
Target
Name:
DNA (cytosine-5)-methyltransferase 1
Synonyms:
AIM CXXC9 DNA (cytosine-5)-methyltransferase 1 isoform b DNA methyltransferase HsaI DNMT1 M.HsaI | MCMT
Type:
Enzyme
Mol. Mass.:
183184.85
Organism:
Homo sapiens (Human)
Description:
P26358
Residue:
1616
  
Inhibitor
Name:
BDBM50294481
Synonyms:
2-amino-4-(((2S,3S,4R,5R)-5-(4-amino-1H-imidazo[4,5-c]pyridin-1-yl)-3,4-dihydroxy-tetrahydrofuran-2-yl)methylthio)butanoic acid | CHEMBL561047
Type:
Small organic molecule
Emp. Form.:
C15H21N5O5S
Mol. Mass.:
383.423
SMILES:
NC(CCSC[C@H]1O[C@H]([C@H](O)[C@@H]1O)n1cnc2c(N)nccc12)C(O)=O
: