Target
DNA (cytosine-5)-methyltransferase 1
Ligand
BDBM50294483
Substrate
Meas. Tech.
ChEMBL_575565 (CHEMBL1036408)
IC50
8000±n/a nM
Citation
 Saavedra, OMIsakovic, LLlewellyn, DBZhan, LBernstein, NClaridge, SRaeppel, FVaisburg, AElowe, NPetschner, AJRahil, JBeaulieu, NMacLeod, ARDelorme, DBesterman, JMWahhab, A SAR around (l)-S-adenosyl-l-homocysteine, an inhibitor of human DNA methyltransferase (DNMT) enzymes. Bioorg Med Chem Lett 19:2747-51 (2009)  
Target
Name:
DNA (cytosine-5)-methyltransferase 1
Synonyms:
AIM CXXC9 DNA (cytosine-5)-methyltransferase 1 isoform b DNA methyltransferase HsaI DNMT1 M.HsaI | MCMT
Type:
Enzyme
Mol. Mass.:
183184.85
Organism:
Homo sapiens (Human)
Description:
P26358
Residue:
1616
  
Inhibitor
Name:
BDBM50294483
Synonyms:
2-amino-4-(((2S,3S,4R,5R)-5-(7-amino-3H-[1,2,3]triazolo[4,5-d]pyrimidin-3-yl)-3,4-dihydroxy-tetrahydrofuran-2-yl)methylthio)butanoic acid | CHEMBL552246
Type:
Small organic molecule
Emp. Form.:
C13H19N7O5S
Mol. Mass.:
385.399
SMILES:
NC(CCSC[C@H]1O[C@H]([C@H](O)[C@@H]1O)n1nnc2c(N)ncnc12)C(O)=O
: