Target
DNA (cytosine-5)-methyltransferase 3B
Ligand
BDBM50294574
Substrate
Meas. Tech.
ChEMBL_575600 (CHEMBL1036445)
IC50
1900±n/a nM
Citation
 Isakovic, LSaavedra, OMLlewellyn, DBClaridge, SZhan, LBernstein, NVaisburg, AElowe, NPetschner, AJRahil, JBeaulieu, NGauthier, FMacLeod, ARDelorme, DBesterman, JMWahhab, A Constrained (l-)-S-adenosyl-l-homocysteine (SAH) analogues as DNA methyltransferase inhibitors. Bioorg Med Chem Lett 19:2742-6 (2009)  
Target
Name:
DNA (cytosine-5)-methyltransferase 3B
Synonyms:
DNM3B_HUMAN | DNMT3B
Type:
PROTEIN
Mol. Mass.:
95771.12
Organism:
Homo sapiens (Human)
Description:
ChEMBL_1473708
Residue:
853
  
Inhibitor
Name:
BDBM50294574
Synonyms:
(2S,4S)-4-(((2S,3S,4R,5S)-5-(6-amino-2-chloro-9H-purin-9-yl)-3,4-dihydroxytetrahydrofuran-2-yl)methylthio)pyrrolidine-2-carboxylic acid | CHEMBL560106
Type:
Small organic molecule
Emp. Form.:
C15H19ClN6O5S
Mol. Mass.:
430.867
SMILES:
Nc1nc(Cl)nc2n(cnc12)[C@@H]1O[C@H](CS[C@@H]2CN[C@@H](C2)C(O)=O)[C@@H](O)[C@H]1O
: