Target
Tyrosine-protein kinase Lck
Ligand
BDBM50305117
Substrate
Meas. Tech.
ChEMBL_603253 (CHEMBL1049477)
IC50
0.560000±n/a nM
Citation
 Takayama, TUmemiya, HAmada, HYabuuchi, TKoami, TShiozawa, FOka, YTakaoka, AYamaguchi, AEndo, MSato, M Ring-fused pyrazole derivatives as potent inhibitors of lymphocyte-specific kinase (Lck): Structure, synthesis, and SAR. Bioorg Med Chem Lett 20:112-6 (2010)  
Target
Name:
Tyrosine-protein kinase Lck
Synonyms:
2.7.10.2 LCK_HUMAN Leukocyte C-terminal Src kinase Lymphocyte-specific protein tyrosine kinase Protein YT16 Proto-oncogene tyrosine-protein kinase LCK T cell-specific protein-tyrosine kinase
Type:
Mol. Mass.:
57987.83
Organism:
Homo sapiens (Human)
Description:
P06239
Residue:
509
  
Inhibitor
Name:
BDBM50305117
Synonyms:
7-(2-morpholinoethoxy)-2-(4-phenoxyphenyl)-9,10-dihydro-4H-benzo[d]pyrazolo[1,5-a][1,3]diazepine-3-carboxamide | CHEMBL596079
Type:
Small organic molecule
Emp. Form.:
C30H31N5O4
Mol. Mass.:
525.5982
SMILES:
NC(=O)c1c2Nc3ccc(OCCN4CCOCC4)cc3CCn2nc1-c1ccc(Oc2ccccc2)cc1
: