Target
Tyrosine-protein kinase CSK
Ligand
BDBM50305126
Substrate
Meas. Tech.
ChEMBL_603255 (CHEMBL1049479)
IC50
1.7±n/a nM
Citation
 Takayama, TUmemiya, HAmada, HYabuuchi, TKoami, TShiozawa, FOka, YTakaoka, AYamaguchi, AEndo, MSato, M Ring-fused pyrazole derivatives as potent inhibitors of lymphocyte-specific kinase (Lck): Structure, synthesis, and SAR. Bioorg Med Chem Lett 20:112-6 (2010)  
Target
Name:
Tyrosine-protein kinase CSK
Synonyms:
C-SRC kinase CSK Protein-tyrosine kinase CYL | Tyrosine Kinase CSK
Type:
Tyrosine-protein kinase
Mol. Mass.:
50707.30
Organism:
Homo sapiens (Human)
Description:
P41240
Residue:
450
  
Inhibitor
Name:
BDBM50305126
Synonyms:
7-(2-(dimethylamino)ethoxy)-2-(4-phenoxyphenyl)-9,10-dihydro-4H-benzo[d]pyrazolo[1,5-a][1,3]diazepine-3-carboxamide | CHEMBL591325
Type:
Small organic molecule
Emp. Form.:
C28H29N5O3
Mol. Mass.:
483.5616
SMILES:
CN(C)CCOc1ccc2Nc3c(C(N)=O)c(nn3CCc2c1)-c1ccc(Oc2ccccc2)cc1
: