Target
Cyclin-dependent kinase 1
Ligand
BDBM50305126
Substrate
Meas. Tech.
ChEMBL_603261 (CHEMBL1049485)
IC50
>10000±n/a nM
Citation
 Takayama, TUmemiya, HAmada, HYabuuchi, TKoami, TShiozawa, FOka, YTakaoka, AYamaguchi, AEndo, MSato, M Ring-fused pyrazole derivatives as potent inhibitors of lymphocyte-specific kinase (Lck): Structure, synthesis, and SAR. Bioorg Med Chem Lett 20:112-6 (2010)  
Target
Name:
Cyclin-dependent kinase 1
Synonyms:
CDC2 CDK1 CDKN1 Cell division protein kinase 1 P34CDC2 | p34 protein kinase
Type:
Enzyme Subunit
Mol. Mass.:
34101.08
Organism:
Homo sapiens (Human)
Description:
P06493
Residue:
297
  
Inhibitor
Name:
BDBM50305126
Synonyms:
7-(2-(dimethylamino)ethoxy)-2-(4-phenoxyphenyl)-9,10-dihydro-4H-benzo[d]pyrazolo[1,5-a][1,3]diazepine-3-carboxamide | CHEMBL591325
Type:
Small organic molecule
Emp. Form.:
C28H29N5O3
Mol. Mass.:
483.5616
SMILES:
CN(C)CCOc1ccc2Nc3c(C(N)=O)c(nn3CCc2c1)-c1ccc(Oc2ccccc2)cc1
: